BDBM50095660 2-Cyclopentyl-2-hydroxy-N-[1-(6-methyl-pyridin-2-ylmethyl)-piperidin-4-yl]-2-phenyl-acetamide::CHEMBL343659
SMILES Cc1cccc(CN2CCC(CC2)NC(=O)C(O)(C2CCCC2)c2ccccc2)n1
InChI Key InChIKey=FFERIMSSXPDFOU-UHFFFAOYSA-N
Data  3 KI
  Tab Delimited (TSV)   2D SDfile   Computed 3D by Vconf -m prep SDfile
Find this compound or compounds like it in BindingDB:
Activity Spreadsheet -- Enzyme Inhibition Constant Data from BindingDB
Found 1 hit for monomerid = 50095660
TargetMuscarinic acetylcholine receptor M3(Homo sapiens (Human))
Banyu Tsukuba Research Institute In Collaboration With Merck Research Laboratories
Curated by ChEMBL
LigandPNGBDBM50095660(2-Cyclopentyl-2-hydroxy-N-[1-(6-methyl-pyridin-2-y...)
Affinity DataKi:  11nM. Assay description: Inhibition of [3H]-NMS binding to human muscarinic acetylcholine receptor M3 expressed in CHO cells
In DepthDetails ArticlePubMed